Remove usage of specific profiles because of project specific options

9 jobs for master in 36 minutes and 26 seconds (queued for 61 minutes and 56 seconds)
latest
Status Job ID Name Coverage
  Build
failed #54564
distcheck-build-linux-clang6-debug

00:05:36

failed #54563
distcheck-build-linux-clang6-release

00:05:45

failed #54565
distcheck-build-linux-clang7-release

00:05:41

passed #54560
distcheck-build-linux-gcc7-debug

00:04:49

passed #54559
distcheck-build-linux-gcc7-release

00:04:36

passed #54562
distcheck-build-linux-gcc8-debug

00:04:57

passed #54561
distcheck-build-linux-gcc8-release

00:04:59

 
  Package
skipped #54566
distcheck-package-linux-bintray
skipped #54567
distcheck-package-linux-lrde
 
Name Stage Failure
failed
distcheck-build-linux-clang6-debug Build
  CMakeLists.txt:5 (conan_basic_setup)


-- Configuring incomplete, errors occurred!
See also "/builds/olena/conan-pybind11/test_package/build/8e7da137254ca61c29cfd61de2482b72ba0ff99c/CMakeFiles/CMakeOutput.log".
ERROR: pybind11/2.2.4@lrde/testing-default (test package): Error in build() method, line 13
cmake.configure()
ConanException: Error 256 while executing cd '/builds/olena/conan-pybind11/test_package/build/8e7da137254ca61c29cfd61de2482b72ba0ff99c' && cmake -G "Unix Makefiles" -DCMAKE_BUILD_TYPE="Release" -DCONAN_EXPORTED="1" -DCONAN_IN_LOCAL_CACHE="OFF" -DCONAN_COMPILER="gcc" -DCONAN_COMPILER_VERSION="8" -DCONAN_CXX_FLAGS="-m64" -DCONAN_SHARED_LINKER_FLAGS="-m64" -DCONAN_C_FLAGS="-m64" -DCONAN_LIBCXX="libstdc++11" -DCMAKE_EXPORT_NO_PACKAGE_REGISTRY="ON" -Wno-dev '/builds/olena/conan-pybind11/test_package'
ERROR: Job failed: exit code 1
failed
distcheck-build-linux-clang6-release Build
  CMakeLists.txt:5 (conan_basic_setup)


-- Configuring incomplete, errors occurred!
See also "/builds/olena/conan-pybind11/test_package/build/8e7da137254ca61c29cfd61de2482b72ba0ff99c/CMakeFiles/CMakeOutput.log".
ERROR: pybind11/2.2.4@lrde/testing-default (test package): Error in build() method, line 13
cmake.configure()
ConanException: Error 256 while executing cd '/builds/olena/conan-pybind11/test_package/build/8e7da137254ca61c29cfd61de2482b72ba0ff99c' && cmake -G "Unix Makefiles" -DCMAKE_BUILD_TYPE="Release" -DCONAN_EXPORTED="1" -DCONAN_IN_LOCAL_CACHE="OFF" -DCONAN_COMPILER="gcc" -DCONAN_COMPILER_VERSION="8" -DCONAN_CXX_FLAGS="-m64" -DCONAN_SHARED_LINKER_FLAGS="-m64" -DCONAN_C_FLAGS="-m64" -DCONAN_LIBCXX="libstdc++11" -DCMAKE_EXPORT_NO_PACKAGE_REGISTRY="ON" -Wno-dev '/builds/olena/conan-pybind11/test_package'
ERROR: Job failed: exit code 1
failed
distcheck-build-linux-clang7-release Build
  CMakeLists.txt:5 (conan_basic_setup)


-- Configuring incomplete, errors occurred!
See also "/builds/olena/conan-pybind11/test_package/build/8e7da137254ca61c29cfd61de2482b72ba0ff99c/CMakeFiles/CMakeOutput.log".
ERROR: pybind11/2.2.4@lrde/testing-default (test package): Error in build() method, line 13
cmake.configure()
ConanException: Error 256 while executing cd '/builds/olena/conan-pybind11/test_package/build/8e7da137254ca61c29cfd61de2482b72ba0ff99c' && cmake -G "Unix Makefiles" -DCMAKE_BUILD_TYPE="Release" -DCONAN_EXPORTED="1" -DCONAN_IN_LOCAL_CACHE="OFF" -DCONAN_COMPILER="gcc" -DCONAN_COMPILER_VERSION="8" -DCONAN_CXX_FLAGS="-m64" -DCONAN_SHARED_LINKER_FLAGS="-m64" -DCONAN_C_FLAGS="-m64" -DCONAN_LIBCXX="libstdc++11" -DCMAKE_EXPORT_NO_PACKAGE_REGISTRY="ON" -Wno-dev '/builds/olena/conan-pybind11/test_package'
ERROR: Job failed: exit code 1