Initial commit

9 jobs for master in 4 minutes and 26 seconds (queued for 3 seconds)
Status Name Job ID Coverage
  Build
failed distcheck-build-linux-clang6-debug #38229

00:00:34

failed distcheck-build-linux-clang6-release #38228

00:00:34

failed distcheck-build-linux-clang7-release #38230

00:00:33

failed distcheck-build-linux-gcc7-debug #38225

00:02:42

failed distcheck-build-linux-gcc7-release #38224

00:04:18

failed distcheck-build-linux-gcc8-debug #38227

00:04:17

failed distcheck-build-linux-gcc8-release #38226

00:04:16

 
  Package
skipped distcheck-package-linux-bintray #38231
skipped distcheck-package-linux-lrde #38232
 
Name Stage Failure
failed
distcheck-build-linux-clang7-release Build
pybind11/2.2.4@mroynard/testing-clang7: 
pybind11/2.2.4@mroynard/testing-clang7: ERROR: Package '5ab84d6acfe1f23c4fae0ab88f26e3a396351ac9' build failed
pybind11/2.2.4@mroynard/testing-clang7: WARN: Build folder /root/.conan/data/pybind11/2.2.4/mroynard/testing-clang7/build/5ab84d6acfe1f23c4fae0ab88f26e3a396351ac9
ERROR: pybind11/2.2.4@mroynard/testing-clang7: Error in build() method, line 38
cmake = self.get_cmake_config()
while calling 'get_cmake_config', line 34
cmake.configure()
ConanException: Error 256 while executing cd '/root/.conan/data/pybind11/2.2.4/mroynard/testing-clang7/build/5ab84d6acfe1f23c4fae0ab88f26e3a396351ac9' && cmake -G "Unix Makefiles" -DCMAKE_BUILD_TYPE="Release" -DCONAN_EXPORTED="1" -DCONAN_IN_LOCAL_CACHE="ON" -DCONAN_COMPILER="clang" -DCONAN_COMPILER_VERSION="7.0" -DCONAN_CXX_FLAGS="-m64" -DCONAN_SHARED_LINKER_FLAGS="-m64" -DCONAN_C_FLAGS="-m64" -DCONAN_LIBCXX="libstdc++11" -DBUILD_SHARED_LIBS="OFF" -DCMAKE_INSTALL_PREFIX="/root/.conan/data/pybind11/2.2.4/mroynard/testing-clang7/package/5ab84d6acfe1f23c4fae0ab88f26e3a396351ac9" -DCMAKE_INSTALL_BINDIR="bin" -DCMAKE_INSTALL_SBINDIR="bin" -DCMAKE_INSTALL_LIBEXECDIR="bin" -DCMAKE_INSTALL_LIBDIR="lib" -DCMAKE_INSTALL_INCLUDEDIR="include" -DCMAKE_INSTALL_OLDINCLUDEDIR="include" -DCMAKE_INSTALL_DATAROOTDIR="share" -DCONAN_CMAKE_POSITION_INDEPENDENT_CODE="ON" -DCMAKE_EXPORT_NO_PACKAGE_REGISTRY="ON" -Wno-dev '/root/.conan/data/pybind11/2.2.4/mroynard/testing-clang7/build/5ab84d6acfe1f23c4fae0ab88f26e3a396351ac9'
ERROR: Job failed: exit code 1
failed
distcheck-build-linux-clang6-debug Build
pybind11/2.2.4@mroynard/testing-clang6: 
pybind11/2.2.4@mroynard/testing-clang6: ERROR: Package '5ab84d6acfe1f23c4fae0ab88f26e3a396351ac9' build failed
pybind11/2.2.4@mroynard/testing-clang6: WARN: Build folder /root/.conan/data/pybind11/2.2.4/mroynard/testing-clang6/build/5ab84d6acfe1f23c4fae0ab88f26e3a396351ac9
ERROR: pybind11/2.2.4@mroynard/testing-clang6: Error in build() method, line 38
cmake = self.get_cmake_config()
while calling 'get_cmake_config', line 34
cmake.configure()
ConanException: Error 256 while executing cd '/root/.conan/data/pybind11/2.2.4/mroynard/testing-clang6/build/5ab84d6acfe1f23c4fae0ab88f26e3a396351ac9' && cmake -G "Unix Makefiles" -DCMAKE_BUILD_TYPE="Release" -DCONAN_EXPORTED="1" -DCONAN_IN_LOCAL_CACHE="ON" -DCONAN_COMPILER="clang" -DCONAN_COMPILER_VERSION="6.0" -DCONAN_CXX_FLAGS="-m64" -DCONAN_SHARED_LINKER_FLAGS="-m64" -DCONAN_C_FLAGS="-m64" -DCONAN_LIBCXX="libstdc++11" -DBUILD_SHARED_LIBS="OFF" -DCMAKE_INSTALL_PREFIX="/root/.conan/data/pybind11/2.2.4/mroynard/testing-clang6/package/5ab84d6acfe1f23c4fae0ab88f26e3a396351ac9" -DCMAKE_INSTALL_BINDIR="bin" -DCMAKE_INSTALL_SBINDIR="bin" -DCMAKE_INSTALL_LIBEXECDIR="bin" -DCMAKE_INSTALL_LIBDIR="lib" -DCMAKE_INSTALL_INCLUDEDIR="include" -DCMAKE_INSTALL_OLDINCLUDEDIR="include" -DCMAKE_INSTALL_DATAROOTDIR="share" -DCONAN_CMAKE_POSITION_INDEPENDENT_CODE="ON" -DCMAKE_EXPORT_NO_PACKAGE_REGISTRY="ON" -Wno-dev '/root/.conan/data/pybind11/2.2.4/mroynard/testing-clang6/build/5ab84d6acfe1f23c4fae0ab88f26e3a396351ac9'
ERROR: Job failed: exit code 1
failed
distcheck-build-linux-clang6-release Build
pybind11/2.2.4@mroynard/testing-clang6: 
pybind11/2.2.4@mroynard/testing-clang6: ERROR: Package '5ab84d6acfe1f23c4fae0ab88f26e3a396351ac9' build failed
pybind11/2.2.4@mroynard/testing-clang6: WARN: Build folder /root/.conan/data/pybind11/2.2.4/mroynard/testing-clang6/build/5ab84d6acfe1f23c4fae0ab88f26e3a396351ac9
ERROR: pybind11/2.2.4@mroynard/testing-clang6: Error in build() method, line 38
cmake = self.get_cmake_config()
while calling 'get_cmake_config', line 34
cmake.configure()
ConanException: Error 256 while executing cd '/root/.conan/data/pybind11/2.2.4/mroynard/testing-clang6/build/5ab84d6acfe1f23c4fae0ab88f26e3a396351ac9' && cmake -G "Unix Makefiles" -DCMAKE_BUILD_TYPE="Release" -DCONAN_EXPORTED="1" -DCONAN_IN_LOCAL_CACHE="ON" -DCONAN_COMPILER="clang" -DCONAN_COMPILER_VERSION="6.0" -DCONAN_CXX_FLAGS="-m64" -DCONAN_SHARED_LINKER_FLAGS="-m64" -DCONAN_C_FLAGS="-m64" -DCONAN_LIBCXX="libstdc++11" -DBUILD_SHARED_LIBS="OFF" -DCMAKE_INSTALL_PREFIX="/root/.conan/data/pybind11/2.2.4/mroynard/testing-clang6/package/5ab84d6acfe1f23c4fae0ab88f26e3a396351ac9" -DCMAKE_INSTALL_BINDIR="bin" -DCMAKE_INSTALL_SBINDIR="bin" -DCMAKE_INSTALL_LIBEXECDIR="bin" -DCMAKE_INSTALL_LIBDIR="lib" -DCMAKE_INSTALL_INCLUDEDIR="include" -DCMAKE_INSTALL_OLDINCLUDEDIR="include" -DCMAKE_INSTALL_DATAROOTDIR="share" -DCONAN_CMAKE_POSITION_INDEPENDENT_CODE="ON" -DCMAKE_EXPORT_NO_PACKAGE_REGISTRY="ON" -Wno-dev '/root/.conan/data/pybind11/2.2.4/mroynard/testing-clang6/build/5ab84d6acfe1f23c4fae0ab88f26e3a396351ac9'
ERROR: Job failed: exit code 1
failed
distcheck-build-linux-gcc8-debug Build
pybind11/2.2.4@mroynard/testing-gcc8: 
pybind11/2.2.4@mroynard/testing-gcc8: ERROR: Package '5ab84d6acfe1f23c4fae0ab88f26e3a396351ac9' build failed
pybind11/2.2.4@mroynard/testing-gcc8: WARN: Build folder /root/.conan/data/pybind11/2.2.4/mroynard/testing-gcc8/build/5ab84d6acfe1f23c4fae0ab88f26e3a396351ac9
ERROR: pybind11/2.2.4@mroynard/testing-gcc8: Error in build() method, line 38
cmake = self.get_cmake_config()
while calling 'get_cmake_config', line 34
cmake.configure()
ConanException: Error 256 while executing cd '/root/.conan/data/pybind11/2.2.4/mroynard/testing-gcc8/build/5ab84d6acfe1f23c4fae0ab88f26e3a396351ac9' && cmake -G "Unix Makefiles" -DCMAKE_BUILD_TYPE="Release" -DCONAN_EXPORTED="1" -DCONAN_IN_LOCAL_CACHE="ON" -DCONAN_COMPILER="gcc" -DCONAN_COMPILER_VERSION="8" -DCONAN_CXX_FLAGS="-m64" -DCONAN_SHARED_LINKER_FLAGS="-m64" -DCONAN_C_FLAGS="-m64" -DCONAN_LIBCXX="libstdc++11" -DBUILD_SHARED_LIBS="OFF" -DCMAKE_INSTALL_PREFIX="/root/.conan/data/pybind11/2.2.4/mroynard/testing-gcc8/package/5ab84d6acfe1f23c4fae0ab88f26e3a396351ac9" -DCMAKE_INSTALL_BINDIR="bin" -DCMAKE_INSTALL_SBINDIR="bin" -DCMAKE_INSTALL_LIBEXECDIR="bin" -DCMAKE_INSTALL_LIBDIR="lib" -DCMAKE_INSTALL_INCLUDEDIR="include" -DCMAKE_INSTALL_OLDINCLUDEDIR="include" -DCMAKE_INSTALL_DATAROOTDIR="share" -DCONAN_CMAKE_POSITION_INDEPENDENT_CODE="ON" -DCMAKE_EXPORT_NO_PACKAGE_REGISTRY="ON" -Wno-dev '/root/.conan/data/pybind11/2.2.4/mroynard/testing-gcc8/build/5ab84d6acfe1f23c4fae0ab88f26e3a396351ac9'
ERROR: Job failed: exit code 1
failed
distcheck-build-linux-gcc8-release Build
pybind11/2.2.4@mroynard/testing-gcc8: 
pybind11/2.2.4@mroynard/testing-gcc8: ERROR: Package '5ab84d6acfe1f23c4fae0ab88f26e3a396351ac9' build failed
pybind11/2.2.4@mroynard/testing-gcc8: WARN: Build folder /root/.conan/data/pybind11/2.2.4/mroynard/testing-gcc8/build/5ab84d6acfe1f23c4fae0ab88f26e3a396351ac9
ERROR: pybind11/2.2.4@mroynard/testing-gcc8: Error in build() method, line 38
cmake = self.get_cmake_config()
while calling 'get_cmake_config', line 34
cmake.configure()
ConanException: Error 256 while executing cd '/root/.conan/data/pybind11/2.2.4/mroynard/testing-gcc8/build/5ab84d6acfe1f23c4fae0ab88f26e3a396351ac9' && cmake -G "Unix Makefiles" -DCMAKE_BUILD_TYPE="Release" -DCONAN_EXPORTED="1" -DCONAN_IN_LOCAL_CACHE="ON" -DCONAN_COMPILER="gcc" -DCONAN_COMPILER_VERSION="8" -DCONAN_CXX_FLAGS="-m64" -DCONAN_SHARED_LINKER_FLAGS="-m64" -DCONAN_C_FLAGS="-m64" -DCONAN_LIBCXX="libstdc++11" -DBUILD_SHARED_LIBS="OFF" -DCMAKE_INSTALL_PREFIX="/root/.conan/data/pybind11/2.2.4/mroynard/testing-gcc8/package/5ab84d6acfe1f23c4fae0ab88f26e3a396351ac9" -DCMAKE_INSTALL_BINDIR="bin" -DCMAKE_INSTALL_SBINDIR="bin" -DCMAKE_INSTALL_LIBEXECDIR="bin" -DCMAKE_INSTALL_LIBDIR="lib" -DCMAKE_INSTALL_INCLUDEDIR="include" -DCMAKE_INSTALL_OLDINCLUDEDIR="include" -DCMAKE_INSTALL_DATAROOTDIR="share" -DCONAN_CMAKE_POSITION_INDEPENDENT_CODE="ON" -DCMAKE_EXPORT_NO_PACKAGE_REGISTRY="ON" -Wno-dev '/root/.conan/data/pybind11/2.2.4/mroynard/testing-gcc8/build/5ab84d6acfe1f23c4fae0ab88f26e3a396351ac9'
ERROR: Job failed: exit code 1
failed
distcheck-build-linux-gcc7-debug Build
pybind11/2.2.4@mroynard/testing-gcc7: 
pybind11/2.2.4@mroynard/testing-gcc7: ERROR: Package '5ab84d6acfe1f23c4fae0ab88f26e3a396351ac9' build failed
pybind11/2.2.4@mroynard/testing-gcc7: WARN: Build folder /root/.conan/data/pybind11/2.2.4/mroynard/testing-gcc7/build/5ab84d6acfe1f23c4fae0ab88f26e3a396351ac9
ERROR: pybind11/2.2.4@mroynard/testing-gcc7: Error in build() method, line 38
cmake = self.get_cmake_config()
while calling 'get_cmake_config', line 34
cmake.configure()
ConanException: Error 256 while executing cd '/root/.conan/data/pybind11/2.2.4/mroynard/testing-gcc7/build/5ab84d6acfe1f23c4fae0ab88f26e3a396351ac9' && cmake -G "Unix Makefiles" -DCMAKE_BUILD_TYPE="Release" -DCONAN_EXPORTED="1" -DCONAN_IN_LOCAL_CACHE="ON" -DCONAN_COMPILER="gcc" -DCONAN_COMPILER_VERSION="7" -DCONAN_CXX_FLAGS="-m64" -DCONAN_SHARED_LINKER_FLAGS="-m64" -DCONAN_C_FLAGS="-m64" -DCONAN_LIBCXX="libstdc++11" -DBUILD_SHARED_LIBS="OFF" -DCMAKE_INSTALL_PREFIX="/root/.conan/data/pybind11/2.2.4/mroynard/testing-gcc7/package/5ab84d6acfe1f23c4fae0ab88f26e3a396351ac9" -DCMAKE_INSTALL_BINDIR="bin" -DCMAKE_INSTALL_SBINDIR="bin" -DCMAKE_INSTALL_LIBEXECDIR="bin" -DCMAKE_INSTALL_LIBDIR="lib" -DCMAKE_INSTALL_INCLUDEDIR="include" -DCMAKE_INSTALL_OLDINCLUDEDIR="include" -DCMAKE_INSTALL_DATAROOTDIR="share" -DCONAN_CMAKE_POSITION_INDEPENDENT_CODE="ON" -DCMAKE_EXPORT_NO_PACKAGE_REGISTRY="ON" -Wno-dev '/root/.conan/data/pybind11/2.2.4/mroynard/testing-gcc7/build/5ab84d6acfe1f23c4fae0ab88f26e3a396351ac9'
ERROR: Job failed: exit code 1
failed
distcheck-build-linux-gcc7-release Build
pybind11/2.2.4@mroynard/testing-gcc7: 
pybind11/2.2.4@mroynard/testing-gcc7: ERROR: Package '5ab84d6acfe1f23c4fae0ab88f26e3a396351ac9' build failed
pybind11/2.2.4@mroynard/testing-gcc7: WARN: Build folder /root/.conan/data/pybind11/2.2.4/mroynard/testing-gcc7/build/5ab84d6acfe1f23c4fae0ab88f26e3a396351ac9
ERROR: pybind11/2.2.4@mroynard/testing-gcc7: Error in build() method, line 38
cmake = self.get_cmake_config()
while calling 'get_cmake_config', line 34
cmake.configure()
ConanException: Error 256 while executing cd '/root/.conan/data/pybind11/2.2.4/mroynard/testing-gcc7/build/5ab84d6acfe1f23c4fae0ab88f26e3a396351ac9' && cmake -G "Unix Makefiles" -DCMAKE_BUILD_TYPE="Release" -DCONAN_EXPORTED="1" -DCONAN_IN_LOCAL_CACHE="ON" -DCONAN_COMPILER="gcc" -DCONAN_COMPILER_VERSION="7" -DCONAN_CXX_FLAGS="-m64" -DCONAN_SHARED_LINKER_FLAGS="-m64" -DCONAN_C_FLAGS="-m64" -DCONAN_LIBCXX="libstdc++11" -DBUILD_SHARED_LIBS="OFF" -DCMAKE_INSTALL_PREFIX="/root/.conan/data/pybind11/2.2.4/mroynard/testing-gcc7/package/5ab84d6acfe1f23c4fae0ab88f26e3a396351ac9" -DCMAKE_INSTALL_BINDIR="bin" -DCMAKE_INSTALL_SBINDIR="bin" -DCMAKE_INSTALL_LIBEXECDIR="bin" -DCMAKE_INSTALL_LIBDIR="lib" -DCMAKE_INSTALL_INCLUDEDIR="include" -DCMAKE_INSTALL_OLDINCLUDEDIR="include" -DCMAKE_INSTALL_DATAROOTDIR="share" -DCONAN_CMAKE_POSITION_INDEPENDENT_CODE="ON" -DCMAKE_EXPORT_NO_PACKAGE_REGISTRY="ON" -Wno-dev '/root/.conan/data/pybind11/2.2.4/mroynard/testing-gcc7/build/5ab84d6acfe1f23c4fae0ab88f26e3a396351ac9'
ERROR: Job failed: exit code 1