Add pytest dependency

9 jobs for master in 8 minutes and 53 seconds (queued for 2 seconds)
Status Name Job ID Coverage
  Build
failed distcheck-build-linux-clang6-debug #38380

00:05:50

failed distcheck-build-linux-clang6-release #38379

00:05:51

failed distcheck-build-linux-clang7-release #38381

00:04:03

failed distcheck-build-linux-gcc7-debug #38376

00:04:52

failed distcheck-build-linux-gcc7-release #38375

00:04:43

failed distcheck-build-linux-gcc8-debug #38378

00:05:08

failed distcheck-build-linux-gcc8-release #38377

00:05:08

 
  Package
skipped distcheck-package-linux-bintray #38382
skipped distcheck-package-linux-lrde #38383
 
Name Stage Failure
failed
distcheck-build-linux-clang7-release Build
make: *** [check] Error 2
Makefile:203: recipe for target 'check' failed
pybind11/2.2.4@mroynard/testing-clang7:
pybind11/2.2.4@mroynard/testing-clang7: ERROR: Package '5ab84d6acfe1f23c4fae0ab88f26e3a396351ac9' build failed
pybind11/2.2.4@mroynard/testing-clang7: WARN: Build folder /root/.conan/data/pybind11/2.2.4/mroynard/testing-clang7/build/5ab84d6acfe1f23c4fae0ab88f26e3a396351ac9
ERROR: pybind11/2.2.4@mroynard/testing-clang7: Error in build() method, line 44
cmake.build(target="check")
ConanException: Error 512 while executing cmake --build '/root/.conan/data/pybind11/2.2.4/mroynard/testing-clang7/build/5ab84d6acfe1f23c4fae0ab88f26e3a396351ac9' '--target' 'check' '--' '-j24'
ERROR: Job failed: exit code 1
failed
distcheck-build-linux-clang6-debug Build
Makefile:203: recipe for target 'check' failed
make: *** [check] Error 2
pybind11/2.2.4@mroynard/testing-clang6:
pybind11/2.2.4@mroynard/testing-clang6: ERROR: Package '5ab84d6acfe1f23c4fae0ab88f26e3a396351ac9' build failed
pybind11/2.2.4@mroynard/testing-clang6: WARN: Build folder /root/.conan/data/pybind11/2.2.4/mroynard/testing-clang6/build/5ab84d6acfe1f23c4fae0ab88f26e3a396351ac9
ERROR: pybind11/2.2.4@mroynard/testing-clang6: Error in build() method, line 44
cmake.build(target="check")
ConanException: Error 512 while executing cmake --build '/root/.conan/data/pybind11/2.2.4/mroynard/testing-clang6/build/5ab84d6acfe1f23c4fae0ab88f26e3a396351ac9' '--target' 'check' '--' '-j16'
ERROR: Job failed: exit code 1
failed
distcheck-build-linux-clang6-release Build
make: *** [check] Error 2
Makefile:203: recipe for target 'check' failed
pybind11/2.2.4@mroynard/testing-clang6:
pybind11/2.2.4@mroynard/testing-clang6: ERROR: Package '5ab84d6acfe1f23c4fae0ab88f26e3a396351ac9' build failed
pybind11/2.2.4@mroynard/testing-clang6: WARN: Build folder /root/.conan/data/pybind11/2.2.4/mroynard/testing-clang6/build/5ab84d6acfe1f23c4fae0ab88f26e3a396351ac9
ERROR: pybind11/2.2.4@mroynard/testing-clang6: Error in build() method, line 44
cmake.build(target="check")
ConanException: Error 512 while executing cmake --build '/root/.conan/data/pybind11/2.2.4/mroynard/testing-clang6/build/5ab84d6acfe1f23c4fae0ab88f26e3a396351ac9' '--target' 'check' '--' '-j16'
ERROR: Job failed: exit code 1
failed
distcheck-build-linux-gcc8-debug Build
Makefile:203: recipe for target 'check' failed
make: *** [check] Error 2
pybind11/2.2.4@mroynard/testing-gcc8:
pybind11/2.2.4@mroynard/testing-gcc8: ERROR: Package '5ab84d6acfe1f23c4fae0ab88f26e3a396351ac9' build failed
pybind11/2.2.4@mroynard/testing-gcc8: WARN: Build folder /root/.conan/data/pybind11/2.2.4/mroynard/testing-gcc8/build/5ab84d6acfe1f23c4fae0ab88f26e3a396351ac9
ERROR: pybind11/2.2.4@mroynard/testing-gcc8: Error in build() method, line 44
cmake.build(target="check")
ConanException: Error 512 while executing cmake --build '/root/.conan/data/pybind11/2.2.4/mroynard/testing-gcc8/build/5ab84d6acfe1f23c4fae0ab88f26e3a396351ac9' '--target' 'check' '--' '-j24'
ERROR: Job failed: exit code 1
failed
distcheck-build-linux-gcc8-release Build
make: *** [check] Error 2
Makefile:203: recipe for target 'check' failed
pybind11/2.2.4@mroynard/testing-gcc8:
pybind11/2.2.4@mroynard/testing-gcc8: ERROR: Package '5ab84d6acfe1f23c4fae0ab88f26e3a396351ac9' build failed
pybind11/2.2.4@mroynard/testing-gcc8: WARN: Build folder /root/.conan/data/pybind11/2.2.4/mroynard/testing-gcc8/build/5ab84d6acfe1f23c4fae0ab88f26e3a396351ac9
ERROR: pybind11/2.2.4@mroynard/testing-gcc8: Error in build() method, line 44
cmake.build(target="check")
ConanException: Error 512 while executing cmake --build '/root/.conan/data/pybind11/2.2.4/mroynard/testing-gcc8/build/5ab84d6acfe1f23c4fae0ab88f26e3a396351ac9' '--target' 'check' '--' '-j24'
ERROR: Job failed: exit code 1
failed
distcheck-build-linux-gcc7-debug Build
Makefile:203: recipe for target 'check' failed
make: *** [check] Error 2
pybind11/2.2.4@mroynard/testing-gcc7:
pybind11/2.2.4@mroynard/testing-gcc7: ERROR: Package '5ab84d6acfe1f23c4fae0ab88f26e3a396351ac9' build failed
pybind11/2.2.4@mroynard/testing-gcc7: WARN: Build folder /root/.conan/data/pybind11/2.2.4/mroynard/testing-gcc7/build/5ab84d6acfe1f23c4fae0ab88f26e3a396351ac9
ERROR: pybind11/2.2.4@mroynard/testing-gcc7: Error in build() method, line 44
cmake.build(target="check")
ConanException: Error 512 while executing cmake --build '/root/.conan/data/pybind11/2.2.4/mroynard/testing-gcc7/build/5ab84d6acfe1f23c4fae0ab88f26e3a396351ac9' '--target' 'check' '--' '-j24'
ERROR: Job failed: exit code 1
failed
distcheck-build-linux-gcc7-release Build
make: *** [check] Error 2
Makefile:203: recipe for target 'check' failed
pybind11/2.2.4@mroynard/testing-gcc7:
pybind11/2.2.4@mroynard/testing-gcc7: ERROR: Package '5ab84d6acfe1f23c4fae0ab88f26e3a396351ac9' build failed
pybind11/2.2.4@mroynard/testing-gcc7: WARN: Build folder /root/.conan/data/pybind11/2.2.4/mroynard/testing-gcc7/build/5ab84d6acfe1f23c4fae0ab88f26e3a396351ac9
ERROR: pybind11/2.2.4@mroynard/testing-gcc7: Error in build() method, line 44
cmake.build(target="check")
ConanException: Error 512 while executing cmake --build '/root/.conan/data/pybind11/2.2.4/mroynard/testing-gcc7/build/5ab84d6acfe1f23c4fae0ab88f26e3a396351ac9' '--target' 'check' '--' '-j24'
ERROR: Job failed: exit code 1