rpm: install texlive-doi

9 jobs for master in 65 minutes and 18 seconds (queued for 1 second)
Status Job ID Name Coverage
  Test
passed #93731
gal2c-debian

00:07:15

passed #93733
spot-alpine

00:22:15

failed #93730
spot-arch

00:09:48

passed #93729
spot-deb-node

00:06:19

passed #93726
spot-deb-stable-amd64

00:37:43

passed #93728
spot-deb-stable-i386

01:05:18

passed #93725
spot-deb-unstable-amd64

00:50:33

failed #93727
spot-deb-unstable-i386

00:01:04

passed #93732
spot-rpm

00:25:59

 
Name Stage Failure
failed
spot-arch Test
/usr/sbin/ld: generalized.o:(.bss+0x38): multiple definition of `scc_stack'; buchi.o:(.bss+0x10): first defined here
collect2: error: ld returned 1 exit status
make: *** [Makefile:37: ltl2ba] Error 1
The command '/bin/sh -c cd /tmp && ./install.sh && rm -f install.sh' returned a non-zero code: 2
make: *** [Makefile:4: build-image] Error 2
make: Leaving directory '/builds/spot/buildenv/arch'
Running after_script
Uploading artifacts for failed job
ERROR: Job failed: exit code 2
failed
spot-deb-unstable-i386 Test
       Depends: gcc-9 (>= 9.2.1-1~) but it is not going to be installed
libtool : Depends: cpp but it is not going to be installed
E: Unable to correct problems, you have held broken packages.
The command '/bin/sh -c echo deb http://debian.mirrors.ovh.net/debian sid main > /etc/apt/sources.list && apt-get update && RUNLEVEL=1 DEBIAN_FRONTEND=noninteractive apt-get install -y wget git emacs-nox emacs-goodies-el org-mode make gcc g++ swig3.0 autoconf automake libtool flex bison graphviz imagemagick optipng doxygen help2man pandoc groff python-all-dev python3-all-dev python3-pandas python3-ipykernel python3-nbconvert python3-entrypoints python3-pygments ipython3 r-base-core r-recommended- r-base-dev- r-base-html- r-cran-data.table r-cran-ggplot2 latexmk texlive-latex-extra texlive-fonts-extra texlive-science texlive-latex-extra-doc- texlive-fonts-extra-doc- texlive-latex-base-doc- texlive-latex-recommended-doc- texlive-pictures-doc- texlive-pstricks-doc- texlive-fonts-recommended-doc- devscripts git-buildpackage cmake dh-python locales && apt-get clean && sed -i 's/# \+\(en_US.UTF.*\)/\1/' /etc/locale.gen && locale-gen && ipython3 -c 'exit;'' returned a non-zero code: 100
make: *** [Makefile:6: build-image] Error 100
make: Leaving directory '/builds/spot/buildenv/deb/unstable-i386'
Running after_script
Uploading artifacts for failed job
ERROR: Job failed: exit code 2