Vcsn 2.8

4 jobs for master in 213 minutes and 34 seconds (queued for 1 second)
Status Job ID Name Coverage
  Test
failed #58317
archlinux:clang:debug

00:06:15

failed #58316
archlinux:gcc:speed

00:04:21

passed #58319
debian:clang:speed

02:08:37

passed #58318
debian:gcc:debug

02:01:10

 
Name Stage Failure
failed
archlinux:clang:debug Test
make[1]: *** [Makefile:3212: lib/ctx/liblal_char_b_la-libctx.lo] Error 1
make[1]: Leaving directory '/builds/vcsn/vcsn/build'
make: *** [Makefile:2360: all] Error 2
Uploading artifacts...
build/*.log: found 1 matching files
WARNING: build/*/*.log: no matching files
WARNING: build/*/*/*.log: no matching files
Uploading artifacts to coordinator... ok
id=58317 responseStatus=201 Created token=y8dPwttC
ERROR: Job failed: exit code 1
failed
archlinux:gcc:speed Test
make[1]: *** [Makefile:3212: lib/ctx/liblal_char_b_la-libctx.lo] Error 1
make[1]: Leaving directory '/builds/vcsn/vcsn/build'
make: *** [Makefile:2360: all] Error 2
Uploading artifacts...
build/*.log: found 1 matching files
WARNING: build/*/*.log: no matching files
WARNING: build/*/*/*.log: no matching files
Uploading artifacts to coordinator... ok
id=58316 responseStatus=201 Created token=-8ZWzDwS
ERROR: Job failed: exit code 1