Fix relative path error

4 jobs for master in 211 minutes and 11 seconds (queued for 1 second)
latest
Status Job ID Name Coverage
  Test
failed #78441
archlinux:clang:debug

02:53:43

failed #78440
archlinux:gcc:speed

03:31:11

failed #78443
debian:clang:speed

00:02:48

failed #78442
debian:gcc:debug

00:02:36

 
Name Stage Failure
failed
archlinux:gcc:speed Test
make[1]: *** [Makefile:4385: check-am] Error 2
make[1]: Leaving directory '/builds/vcsn/vcsn/build'
make: *** [Makefile:4388: check] Error 2
Uploading artifacts...
build/*.log: found 1 matching files
build/*/*.log: found 1 matching files

build/*/*/*.log: found 300 matching files

Uploading artifacts to coordinator... ok
id=78440 responseStatus=201 Created token=4s6he4w6
ERROR: Job failed: exit code 1
failed
archlinux:clang:debug Test
make[1]: *** [Makefile:4388: check] Error 2
make[1]: Leaving directory '/builds/vcsn/vcsn/build'
make: *** [Makefile:5184: installcheck-local] Error 2
Uploading artifacts...
build/*.log: found 1 matching files
build/*/*.log: found 1 matching files

build/*/*/*.log: found 300 matching files

Uploading artifacts to coordinator... ok
id=78441 responseStatus=201 Created token=gQbBZdaJ
ERROR: Job failed: exit code 1
failed
debian:clang:speed Test
bison++: did not find any file in ../lib/vcsn/rat/parse.dir
make: *** [Makefile:4814: lib/vcsn/rat/parse.stamp] Error 1
make: *** Waiting for unfinished jobs....
Uploading artifacts...
build/*.log: found 1 matching files
WARNING: build/*/*.log: no matching files
WARNING: build/*/*/*.log: no matching files
Uploading artifacts to coordinator... ok
id=78443 responseStatus=201 Created token=FkkkXXsc
ERROR: Job failed: exit code 1
failed
debian:gcc:debug Test
bison++: did not find any file in ../lib/vcsn/rat/parse.dir
make: *** [Makefile:4814: lib/vcsn/rat/parse.stamp] Error 1
make: *** Waiting for unfinished jobs....
Uploading artifacts...
build/*.log: found 1 matching files
WARNING: build/*/*.log: no matching files
WARNING: build/*/*/*.log: no matching files
Uploading artifacts to coordinator... ok
id=78442 responseStatus=201 Created token=8QEZysxg
ERROR: Job failed: exit code 1