Merge branch 'ph/fuse-switch-handle-yycase' into 'master'

Fix the build for recent versions of boost and bison

See merge request !6
4 jobs for master in 170 minutes and 18 seconds (queued for 1 second)
latest
Status Job ID Name Coverage
  Test
failed #59395
archlinux:clang:debug

02:11:37

failed #59394
archlinux:gcc:speed

02:50:18

passed #59397
debian:clang:speed

02:15:14

passed #59396
debian:gcc:debug

02:02:13

 
Name Stage Failure
failed
archlinux:gcc:speed Test
make[1]: *** [Makefile:4385: check-am] Error 2
make[1]: Leaving directory '/builds/vcsn/vcsn/build'
make: *** [Makefile:4388: check] Error 2
Uploading artifacts...
build/*.log: found 1 matching files
build/*/*.log: found 1 matching files

build/*/*/*.log: found 300 matching files

Uploading artifacts to coordinator... ok
id=59394 responseStatus=201 Created token=ncyztHQ8
ERROR: Job failed: exit code 1
failed
archlinux:clang:debug Test
make[1]: *** [Makefile:4388: check] Error 2
make[1]: Leaving directory '/builds/vcsn/vcsn/build'
make: *** [Makefile:5183: installcheck-local] Error 2
Uploading artifacts...
build/*.log: found 1 matching files
build/*/*.log: found 1 matching files

build/*/*/*.log: found 300 matching files

Uploading artifacts to coordinator... ok
id=59395 responseStatus=201 Created token=8RXUEC6y
ERROR: Job failed: exit code 1